Reaction Details
TargetCarbonic anhydrase 2
LigandBDBM50167414
Substrate/Competitorn/a
Meas. Tech.ChEMBL_302531 (CHEMBL827383)
Ki 5.3±n/a nM
Citation Puccetti, LFasolis, GVullo, DChohan, ZHScozzafava, ASupuran, CT Carbonic anhydrase inhibitors. Inhibition of cytosolic/tumor-associated carbonic anhydrase isozymes I, II, IX, and XII with Schiff's bases incorporating chromone and aromatic sulfonamide moieties, and their zinc complexes. Bioorg Med Chem Lett15:3096-101 (2005) 
 
Carbonic anhydrase 2
Name:Carbonic anhydrase 2
Type:Enzyme
Mol. Mass.:29250.71
Organism:Homo sapiens (Human)
Description:P00918
Residue:260
BDBM50167414
NameBDBM50167414
Synonyms:CHEMBL274255 | sulfanilamide derivative
TypeSmall organic molecule
Emp. Form.C36H36Cl2N4O8S2Zn
Mol. Mass.853.138
SMILESCc1ccc2OC=C3CN(Cc4ccc(cc4)S(N)(=O)=O)[Zn]4(Cl)(Cl)(OC3c2c1)OC1C(CN4Cc2ccc(cc2)S(N)(=O)=O)=COc2ccc(C)cc12