Reaction Details
TargetCarbonic anhydrase 2
LigandBDBM50167416
Substrate/Competitorn/a
Meas. Tech.ChEMBL_302531 (CHEMBL827383)
Ki 55±n/a nM
Citation Puccetti, LFasolis, GVullo, DChohan, ZHScozzafava, ASupuran, CT Carbonic anhydrase inhibitors. Inhibition of cytosolic/tumor-associated carbonic anhydrase isozymes I, II, IX, and XII with Schiff's bases incorporating chromone and aromatic sulfonamide moieties, and their zinc complexes. Bioorg Med Chem Lett15:3096-101 (2005) 
 
Carbonic anhydrase 2
Name:Carbonic anhydrase 2
Type:Enzyme
Mol. Mass.:29250.71
Organism:Homo sapiens (Human)
Description:P00918
Residue:260
BDBM50167416
NameBDBM50167416
Synonyms:4-(((6-methyl-4-oxo-4H-chromen-3-yl)methyleneamino)methyl)benzenesulfonamide CHEMBL193907
TypeSmall organic molecule
Emp. Form.C18H16N2O4S
Mol. Mass.356.396
SMILESCc1ccc2occ(\C=N\Cc3ccc(cc3)S(N)(=O)=O)c(=O)c2c1