Reaction Details
TargetCarbonic anhydrase 9
LigandBDBM50167412
Substrate/Competitorn/a
Meas. Tech.ChEMBL_302532 (CHEMBL827384)
Ki 12±n/a nM
Citation Puccetti, LFasolis, GVullo, DChohan, ZHScozzafava, ASupuran, CT Carbonic anhydrase inhibitors. Inhibition of cytosolic/tumor-associated carbonic anhydrase isozymes I, II, IX, and XII with Schiff's bases incorporating chromone and aromatic sulfonamide moieties, and their zinc complexes. Bioorg Med Chem Lett15:3096-101 (2005) 
 
Carbonic anhydrase 9
Name:Carbonic anhydrase 9
Type:Enzyme
Mol. Mass.:49669.03
Organism:Homo sapiens (Human)
Description:Catalytic domain of human cloned isozyme was used in the assay
Residue:459
BDBM50167412
NameBDBM50167412
Synonyms:CHEMBL382309 | sulfanilamide derivative
TypeSmall organic molecule
Emp. Form.C38H40Cl2N4O8S2Zn
Mol. Mass.881.191
SMILESCc1ccc2OC=C3CN(CCc4ccc(cc4)S(N)(=O)=O)[Zn]4(Cl)(Cl)(OC3c2c1)OC1C(CN4CCc2ccc(cc2)S(N)(=O)=O)=COc2ccc(C)cc12