Reaction Details
TargetCarbonic anhydrase 12
LigandBDBM50167418
Substrate/Competitorn/a
Meas. Tech.ChEMBL_302561 (CHEMBL839523)
Ki 19±n/a nM
Citation Puccetti, LFasolis, GVullo, DChohan, ZHScozzafava, ASupuran, CT Carbonic anhydrase inhibitors. Inhibition of cytosolic/tumor-associated carbonic anhydrase isozymes I, II, IX, and XII with Schiff's bases incorporating chromone and aromatic sulfonamide moieties, and their zinc complexes. Bioorg Med Chem Lett15:3096-101 (2005) 
 
Carbonic anhydrase 12
Name:Carbonic anhydrase 12
Type:Enzyme
Mol. Mass.:39456.00
Organism:Homo sapiens (Human)
Description:Catalytic domain of human cloned isozyme was used in the assay
Residue:354
BDBM50167418
NameBDBM50167418
Synonyms:4-(2-((6-methyl-4-oxo-4H-chromen-3-yl)methyleneamino)pyrimidin-4-ylamino)benzenesulfonamide CHEMBL372497
TypeSmall organic molecule
Emp. Form.C21H17N5O4S
Mol. Mass.435.456
SMILESCc1ccc2occ(\C=N\c3nccc(Nc4ccc(cc4)S(N)(=O)=O)n3)c(=O)c2c1