Reaction Details
TargetCarbonic anhydrase 12
LigandBDBM50167404
Substrate/Competitorn/a
Meas. Tech.ChEMBL_302561 (CHEMBL839523)
Ki 27±n/a nM
Citation Puccetti, LFasolis, GVullo, DChohan, ZHScozzafava, ASupuran, CT Carbonic anhydrase inhibitors. Inhibition of cytosolic/tumor-associated carbonic anhydrase isozymes I, II, IX, and XII with Schiff's bases incorporating chromone and aromatic sulfonamide moieties, and their zinc complexes. Bioorg Med Chem Lett15:3096-101 (2005) 
 
Carbonic anhydrase 12
Name:Carbonic anhydrase 12
Type:Enzyme
Mol. Mass.:39456.00
Organism:Homo sapiens (Human)
Description:Catalytic domain of human cloned isozyme was used in the assay
Residue:354
BDBM50167404
NameBDBM50167404
Synonyms:4-((4-oxo-4H-chromen-3-yl)methyleneamino)-6-(trifluoromethyl)benzene-1,3-disulfonamide CHEMBL193924
TypeSmall organic molecule
Emp. Form.C17H12F3N3O6S2
Mol. Mass.475.419
SMILESNS(=O)(=O)c1cc(c(cc1\N=C\c1coc2ccccc2c1=O)C(F)(F)F)S(N)(=O)=O