Reaction Details
TargetCarbonic anhydrase 1
LigandBDBM50167402
Substrate/Competitorn/a
Meas. Tech.ChEMBL_302503 (CHEMBL828219)
Ki 37±n/a nM
Citation Puccetti, LFasolis, GVullo, DChohan, ZHScozzafava, ASupuran, CT Carbonic anhydrase inhibitors. Inhibition of cytosolic/tumor-associated carbonic anhydrase isozymes I, II, IX, and XII with Schiff's bases incorporating chromone and aromatic sulfonamide moieties, and their zinc complexes. Bioorg Med Chem Lett15:3096-101 (2005) 
 
Carbonic anhydrase 1
Name:Carbonic anhydrase 1
Type:Enzyme
Mol. Mass.:28873.37
Organism:Homo sapiens (Human)
Description:P00915
Residue:261
BDBM50167402
NameBDBM50167402
Synonyms:4-(2-((4-oxo-4H-chromen-3-yl)methyleneamino)pyrimidin-4-ylamino)benzenesulfonamide CHEMBL195615
TypeSmall organic molecule
Emp. Form.C20H15N5O4S
Mol. Mass.421.429
SMILESNS(=O)(=O)c1ccc(Nc2ccnc(\N=C\c3coc4ccccc4c3=O)n2)cc1