Reaction Details
TargetCarbonic anhydrase 2
LigandBDBM50167410
Substrate/Competitorn/a
Meas. Tech.ChEMBL_302531 (CHEMBL827383)
Ki>1000±n/a nM
Citation Puccetti, LFasolis, GVullo, DChohan, ZHScozzafava, ASupuran, CT Carbonic anhydrase inhibitors. Inhibition of cytosolic/tumor-associated carbonic anhydrase isozymes I, II, IX, and XII with Schiff's bases incorporating chromone and aromatic sulfonamide moieties, and their zinc complexes. Bioorg Med Chem Lett15:3096-101 (2005) 
 
Carbonic anhydrase 2
Name:Carbonic anhydrase 2
Type:Enzyme
Mol. Mass.:29250.71
Organism:Homo sapiens (Human)
Description:P00918
Residue:260
BDBM50167410
NameBDBM50167410
Synonyms:1N-amino(imino)methyl-4-[1-(6-methyl-4-oxo-4H-3-chromenyl)-(E)-methylideneamino]-1-benzenesulfonamide | CHEMBL193593
TypeSmall organic molecule
Emp. Form.C18H16N4O4S
Mol. Mass.384.409
SMILESCc1ccc2occ(C=Nc3ccc(cc3)S(=O)(=O)NC(N)=N)c(=O)c2c1