Reaction Details
TargetC-C chemokine receptor type 3
LigandBDBM50167438
Substrate/Competitorn/a
Meas. Tech.ChEMBL_303350 (CHEMBL839665)
Ki 7.3±n/a nM
Citation Ting, PCUmland, SPAslanian, RCao, JGarlisi, CGHuang, YJakway, JLiu, ZShah, HTian, FWan, YShih, NY The synthesis of substituted bipiperidine amide compounds as CCR3 ligands: antagonists versus agonists. Bioorg Med Chem Lett15:3020-3 (2005) 
 
C-C chemokine receptor type 3
Name:C-C chemokine receptor type 3
Type:Enzyme
Mol. Mass.:41053.88
Organism:Homo sapiens (Human)
Description:P51677
Residue:355
BDBM50167438
NameBDBM50167438
Synonyms:CHEMBL191464 | Quinoline-6-carboxylic acid [1'-(3,4-dichloro-benzyl)-3'-methyl-[1,4']bipiperidinyl-3-ylmethyl]-amide
TypeSmall organic molecule
Emp. Form.C29H34Cl2N4O
Mol. Mass.525.512
SMILESCC1CN(Cc2ccc(Cl)c(Cl)c2)CCC1N1CCCC(CNC(=O)c2ccc3ncccc3c2)C1