Reaction Details
TargetC-C chemokine receptor type 3
LigandBDBM50167442
Substrate/Competitorn/a
Meas. Tech.ChEMBL_303341 (CHEMBL840157)
Ki 29±n/a nM
Citation Ting, PCUmland, SPAslanian, RCao, JGarlisi, CGHuang, YJakway, JLiu, ZShah, HTian, FWan, YShih, NY The synthesis of substituted bipiperidine amide compounds as CCR3 ligands: antagonists versus agonists. Bioorg Med Chem Lett15:3020-3 (2005) 
 
C-C chemokine receptor type 3
Name:C-C chemokine receptor type 3
Type:Enzyme
Mol. Mass.:41053.88
Organism:Homo sapiens (Human)
Description:P51677
Residue:355
BDBM50167442
NameBDBM50167442
Synonyms:1H-Indole-5-carboxylic acid [1'-(3,4-dichloro-benzyl)-[1,4']bipiperidinyl-3-ylmethyl]-amide | CHEMBL190436
TypeSmall organic molecule
Emp. Form.C27H32Cl2N4O
Mol. Mass.499.475
SMILESClc1ccc(CN2CCC(CC2)N2CCCC(CNC(=O)c3ccc4[nH]ccc4c3)C2)cc1Cl