Reaction Details
TargetTryptase beta-2
LigandBDBM50167525
Substrate/Competitorn/a
Meas. Tech.ChEMBL_302629 (CHEMBL839921)
Ki 57±n/a nM
Citation Hopkins, CRCzekaj, MKaye, SSGao, ZPribish, JPauls, HLiang, GSides, KCramer, DCairns, JLuo, YLim, HKVaz, RRebello, SMaignan, SDupuy, AMathieu, MLevell, J Design, synthesis, and biological activity of potent and selective inhibitors of mast cell tryptase. Bioorg Med Chem Lett15:2734-7 (2005) 
 
Tryptase beta-2
Name:Tryptase beta-2
Type:PROTEIN
Mol. Mass.:30518.79
Organism:Homo sapiens (Human)
Description:ChEMBL_210702
Residue:275
BDBM50167525
NameBDBM50167525
Synonyms:CHEMBL193514 | [4-(3-Aminomethyl-phenyl)-piperidin-1-yl]-[1-(2-methoxy-ethyl)-1H-indol-3-yl]-methanone; TFA
TypeSmall organic molecule
Emp. Form.C24H29N3O2
Mol. Mass.391.506
SMILESCOCCn1cc(C(=O)N2CCC(CC2)c2cccc(CN)c2)c2ccccc12