Reaction Details
TargetMelanin-concentrating hormone receptor 1
LigandBDBM50167552
Substrate/Competitorn/a
Meas. Tech.ChEMBL_306352 (CHEMBL828171)
IC50 2.4±n/a nM
Citation Souers, AJGao, JWodka, DJudd, ASMulhern, MMNapier, JJBrune, MEBush, ENBrodjian, SJDayton, BDShapiro, RHernandez, LEMarsh, KCSham, HLCollins, CAKym, PR Synthesis and evaluation of urea-based indazoles as melanin-concentrating hormone receptor 1 antagonists for the treatment of obesity. Bioorg Med Chem Lett15:2752-7 (2005) 
 
Melanin-concentrating hormone receptor 1
Name:Melanin-concentrating hormone receptor 1
Type:PROTEIN
Mol. Mass.:39133.74
Organism:Mus musculus
Description:ChEMBL_818502
Residue:353
BDBM50167552
NameBDBM50167552
Synonyms:1-[1-(2-Cyclopentylamino-ethyl)-1H-indazol-5-yl]-3-(4-phenoxy-phenyl)-urea | CHEMBL196599
TypeSmall organic molecule
Emp. Form.C27H29N5O2
Mol. Mass.455.5515
SMILESO=C(Nc1ccc(Oc2ccccc2)cc1)Nc1ccc2n(CCNC3CCCC3)ncc2c1