Reaction Details
TargetAlpha-2A adrenergic receptor
LigandBDBM50167576
Substrate/Competitorn/a
Meas. Tech.ChEMBL_302589 (CHEMBL839549)
Ki 1.4±n/a nM
Citation Mustafa, SMBavadekar, SAMa, GMoore, BMFeller, DRMiller, DD Synthesis and biological studies of yohimbine derivatives on human alpha2C-adrenergic receptors. Bioorg Med Chem Lett15:2758-60 (2005) 
 
Alpha-2A adrenergic receptor
Name:Alpha-2A adrenergic receptor
Type:Enzyme
Mol. Mass.:48979.91
Organism:Homo sapiens (Human)
Description:P08913
Residue:450
BDBM50167576
NameBDBM50167576
Synonyms:(1R,2S,4aR,13bS)-2-Hydroxy-1,2,3,4,4a,5,7,8,13,13b,14,14a-dodecahydro-indolo[2',3':3,4]pyrido[1,2-b]isoquinoline-1-carboxylic acid methyl ester | CHEMBL196400
TypeSmall organic molecule
Emp. Form.C21H26N2O3
Mol. Mass.354.4427
SMILESCOC(=O)[C@H]1[C@@H](O)CC[C@H]2CN3CCc4c([nH]c5ccccc45)[C@@H]3CC12