Reaction Details
TargetAlpha-2A adrenergic receptor
LigandBDBM50167573
Substrate/Competitorn/a
Meas. Tech.ChEMBL_302589 (CHEMBL839549)
Ki 29±n/a nM
Citation Mustafa, SMBavadekar, SAMa, GMoore, BMFeller, DRMiller, DD Synthesis and biological studies of yohimbine derivatives on human alpha2C-adrenergic receptors. Bioorg Med Chem Lett15:2758-60 (2005) 
 
Alpha-2A adrenergic receptor
Name:Alpha-2A adrenergic receptor
Type:Enzyme
Mol. Mass.:48979.91
Organism:Homo sapiens (Human)
Description:P08913
Residue:450
BDBM50167573
NameBDBM50167573
Synonyms:4-[((1R,2S,4aR,13bS)-2-Hydroxy-1,2,3,4,4a,5,7,8,13,13b,14,14a-dodecahydro-indolo[2',3':3,4]pyrido[1,2-b]isoquinoline-1-carbonyl)-amino]-butyric acid benzyl ester | CHEMBL196451
TypeSmall organic molecule
Emp. Form.C31H37N3O4
Mol. Mass.515.6432
SMILESO[C@H]1CC[C@H]2CN3CCc4c([nH]c5ccccc45)[C@@H]3CC2[C@H]1C(=O)NCCCC(=O)OCc1ccccc1