Reaction Details
TargetCollagenase 3
LigandBDBM50167618
Substrate/Competitorn/a
Meas. Tech.ChEMBL_304865 (CHEMBL829242)
IC50 1.4±n/a nM
Citation Noe, MCNatarajan, VSnow, SLMitchell, PGLopresti-Morrow, LReeves, LMYocum, SACarty, TJBarberia, JASweeney, FJLiras, JLVaughn, MHardink, JRHawkins, JMTokar, C Discovery of 3,3-dimethyl-5-hydroxypipecolic hydroxamate-based inhibitors of aggrecanase and MMP-13. Bioorg Med Chem Lett15:2808-11 (2005) 
 
Collagenase 3
Name:Collagenase 3
Type:Enzyme
Mol. Mass.:53808.06
Organism:Homo sapiens (Human)
Description:P45452
Residue:471
BDBM50167618
NameBDBM50167618
Synonyms:(2R,5R)-1-[4-(4-Bromo-benzyloxy)-benzenesulfonyl]-5-hydroxy-3,3-dimethyl-piperidine-2-carboxylic acid hydroxyamide | CHEMBL370312
TypeSmall organic molecule
Emp. Form.C21H25BrN2O6S
Mol. Mass.513.402
SMILESCC1(C)C[C@@H](O)CN([C@H]1C(=O)NO)S(=O)(=O)c1ccc(OCc2ccc(Br)cc2)cc1