Reaction Details
TargetEstrogen receptor
LigandBDBM50167740
Substrate/Competitorn/a
Meas. Tech.ChEMBL_305813 (CHEMBL829466)
IC50 51.4±n/a nM
Citation Ji, QGao, JWang, JYang, CHui, XYan, XWu, XXie, YWang, MW Benzothieno[3,2-b]indole derivatives as potent selective estrogen receptor modulators. Bioorg Med Chem Lett15:2891-3 (2005) 
 
Estrogen receptor
Name:Estrogen receptor
Type:Protein
Mol. Mass.:66230.44
Organism:Homo sapiens (Human)
Description:P03372
Residue:595
BDBM50167740
NameBDBM50167740
Synonyms:10-[4-(2-Dimethylamino-ethoxy)-benzyl]-10H-benzo[4,5]thieno[3,2-b]indol-7-ol | CHEMBL196283
TypeSmall organic molecule
Emp. Form.C25H24N2O2S
Mol. Mass.416.535
SMILESCN(C)CCOc1ccc(Cn2c3ccccc3c3sc4cc(O)ccc4c23)cc1