Reaction Details
TargetEstrogen receptor beta
LigandBDBM50167741
Substrate/Competitorn/a
Meas. Tech.ChEMBL_305778 (CHEMBL827967)
IC50 16.4±n/a nM
Citation Ji, QGao, JWang, JYang, CHui, XYan, XWu, XXie, YWang, MW Benzothieno[3,2-b]indole derivatives as potent selective estrogen receptor modulators. Bioorg Med Chem Lett15:2891-3 (2005) 
 
Estrogen receptor beta
Name:Estrogen receptor beta
Type:Protein
Mol. Mass.:59238.43
Organism:Homo sapiens (Human)
Description:Q92731
Residue:530
BDBM50167741
NameBDBM50167741
Synonyms:10-[4-(2-Diethylamino-ethoxy)-benzyl]-10H-benzo[4,5]thieno[3,2-b]indole-3,7-diol | CHEMBL382734
TypeSmall organic molecule
Emp. Form.C27H28N2O3S
Mol. Mass.460.588
SMILESCCN(CC)CCOc1ccc(Cn2c3ccc(O)cc3c3sc4cc(O)ccc4c23)cc1