Reaction Details
TargetEstrogen receptor beta
LigandBDBM50167735
Substrate/Competitorn/a
Meas. Tech.ChEMBL_305778 (CHEMBL827967)
IC50 20.2±n/a nM
Citation Ji, QGao, JWang, JYang, CHui, XYan, XWu, XXie, YWang, MW Benzothieno[3,2-b]indole derivatives as potent selective estrogen receptor modulators. Bioorg Med Chem Lett15:2891-3 (2005) 
 
Estrogen receptor beta
Name:Estrogen receptor beta
Type:Protein
Mol. Mass.:59238.43
Organism:Homo sapiens (Human)
Description:Q92731
Residue:530
BDBM50167735
NameBDBM50167735
Synonyms:10-[4-(2-Pyrrolidin-1-yl-ethoxy)-benzyl]-10H-benzo[4,5]thieno[3,2-b]indole-3,7-diol | CHEMBL370849
TypeSmall organic molecule
Emp. Form.C27H26N2O3S
Mol. Mass.458.572
SMILESOc1ccc2c(c1)sc1c3cc(O)ccc3n(Cc3ccc(OCCN4CCCC4)cc3)c21