Reaction Details
TargetEstrogen receptor
LigandBDBM50167741
Substrate/Competitorn/a
Meas. Tech.ChEMBL_305813 (CHEMBL829466)
IC50 31.2±n/a nM
Citation Ji, QGao, JWang, JYang, CHui, XYan, XWu, XXie, YWang, MW Benzothieno[3,2-b]indole derivatives as potent selective estrogen receptor modulators. Bioorg Med Chem Lett15:2891-3 (2005) 
 
Estrogen receptor
Name:Estrogen receptor
Type:Protein
Mol. Mass.:66230.44
Organism:Homo sapiens (Human)
Description:P03372
Residue:595
BDBM50167741
NameBDBM50167741
Synonyms:10-[4-(2-Diethylamino-ethoxy)-benzyl]-10H-benzo[4,5]thieno[3,2-b]indole-3,7-diol | CHEMBL382734
TypeSmall organic molecule
Emp. Form.C27H28N2O3S
Mol. Mass.460.588
SMILESCCN(CC)CCOc1ccc(Cn2c3ccc(O)cc3c3sc4cc(O)ccc4c23)cc1