Reaction Details
TargetEstrogen receptor
LigandBDBM50167742
Substrate/Competitorn/a
Meas. Tech.ChEMBL_305813 (CHEMBL829466)
IC50 27.2±n/a nM
Citation Ji, QGao, JWang, JYang, CHui, XYan, XWu, XXie, YWang, MW Benzothieno[3,2-b]indole derivatives as potent selective estrogen receptor modulators. Bioorg Med Chem Lett15:2891-3 (2005) 
 
Estrogen receptor
Name:Estrogen receptor
Type:Protein
Mol. Mass.:66230.44
Organism:Homo sapiens (Human)
Description:P03372
Residue:595
BDBM50167742
NameBDBM50167742
Synonyms:10-[4-(2-Pyrrolidin-1-yl-ethoxy)-benzyl]-10H-benzo[4,5]thieno[3,2-b]indol-7-ol | CHEMBL371308
TypeSmall organic molecule
Emp. Form.C27H26N2O2S
Mol. Mass.442.573
SMILESOc1ccc2c(c1)sc1c3ccccc3n(Cc3ccc(OCCN4CCCC4)cc3)c21