Reaction Details
TargetGlucocorticoid receptor
LigandBDBM50167815
Substrate/Competitorn/a
Meas. Tech.ChEMBL_305322 (CHEMBL833544)
IC50 2.2±n/a nM
Citation Smith, CJAli, ABalkovec, JMGraham, DWHammond, MLPatel, GFRouen, GPSmith, SKTata, JREinstein, MGe, LHarris, GSKelly, TMMazur, PThompson, CMWang, CFWilliamson, JMMiller, DKPandit, SSantoro, JCSitlani, AYamin, TTO'Neill, EAZaller, DMCarballo-Jane, EForrest, MJLuell, S Novel ketal ligands for the glucocorticoid receptor: in vitro and in vivo activity. Bioorg Med Chem Lett15:2926-31 (2005) 
 
Glucocorticoid receptor
Name:Glucocorticoid receptor
Type:Enzyme
Mol. Mass.:85656.87
Organism:Homo sapiens (Human)
Description:P04150
Residue:777
BDBM50167815
NameBDBM50167815
Synonyms:1-(4-fluorophenyl)-4',4',4a,6'-tetramethyl-(4aS,6'R)-spiro[1,4,4a,5,6,7-hexahydrocyclopenta[f]indazole-5,2'-(dihydro-4'H-[1,3]dioxane)] | CHEMBL195654
TypeSmall organic molecule
Emp. Form.C23H27FN2O2
Mol. Mass.382.4711
SMILESC[C@@H]1CC(C)(C)O[C@]2(CCC3=Cc4c(C[C@]23C)cnn4-c2ccc(F)cc2)O1