Reaction Details
TargetHigh affinity nerve growth factor receptor
LigandBDBM6760
Substrate/Competitorn/a
Meas. Tech.ChEMBL_306568 (CHEMBL832085)
IC50 13±n/a nM
Citation Gingrich, DEYang, SXGessner, GWAngeles, TSHudkins, RL Synthesis, modeling, and in vitro activity of (3'S)-epi-K-252a analogues. Elucidating the stereochemical requirements of the 3'-sugar alcohol on trkA tyrosine kinase activity. J Med Chem48:3776-83 (2005) 
 
High affinity nerve growth factor receptor
Name:High affinity nerve growth factor receptor
Type:n/a
Mol. Mass.:87498.18
Organism:Homo sapiens (Human)
Description:P04629
Residue:796
BDBM6760
NameBDBM6760
Synonyms:(+)-K-252a K-252a | methyl (15S,16R,18R)-16-hydroxy-15-methyl-3-oxo-28-oxa-4,14,19-triazaoctacyclo[12.11.2.1^{15,18}.0^{2,6}.0^{7,27}.0^{8,13}.0^{19,26}.0^{20,25}]octacosa-1(26),2(6),7(27),8(13),9,11,20(25),21,23-nonaene-16-carboxylate
TypeSmall organic molecule
Emp. Form.C27H21N3O5
Mol. Mass.467.4727
SMILESCOC(=O)[C@@]1(O)C[C@H]2O[C@]1(C)n1c3ccccc3c3c4CNC(=O)c4c4c5ccccc5n2c4c13