Reaction Details
TargetDipeptidyl peptidase 8
LigandBDBM12182
Substrate/Competitorn/a
Meas. Tech.ChEMBL_304640 (CHEMBL828523)
IC50 120±n/a nM
Citation Lu, ILLee, SJTsu, HWu, SYKao, KHChien, CHChang, YYChen, YSCheng, JHChang, CNChen, TWChang, SPChen, XJiaang, WT Glutamic acid analogues as potent dipeptidyl peptidase IV and 8 inhibitors. Bioorg Med Chem Lett15:3271-5 (2005) 
 
Dipeptidyl peptidase 8
Name:Dipeptidyl peptidase 8
Type:Enzyme
Mol. Mass.:103342.62
Organism:Homo sapiens (Human)
Description:Q6V1X1
Residue:898
BDBM12182
NameBDBM12182
Synonyms:(2S)-1-[(2S)-2-amino-4-oxo-4-(1,2,3,4-tetrahydroisoquinolin-2-yl)butanoyl]pyrrolidine-2-carbonitrile cyanopyrrolidine derivative 5
TypeSmall organic molecule
Emp. Form.C18H22N4O2
Mol. Mass.326.3929
SMILESN[C@@H](CC(=O)N1CCc2ccccc2C1)C(=O)N1CCC[C@H]1C#N