Reaction Details
TargetDipeptidyl peptidase 8
LigandBDBM50168272
Substrate/Competitorn/a
Meas. Tech.ChEMBL_304640 (CHEMBL828523)
IC50 71±n/a nM
Citation Lu, ILLee, SJTsu, HWu, SYKao, KHChien, CHChang, YYChen, YSCheng, JHChang, CNChen, TWChang, SPChen, XJiaang, WT Glutamic acid analogues as potent dipeptidyl peptidase IV and 8 inhibitors. Bioorg Med Chem Lett15:3271-5 (2005) 
 
Dipeptidyl peptidase 8
Name:Dipeptidyl peptidase 8
Type:Enzyme
Mol. Mass.:103342.62
Organism:Homo sapiens (Human)
Description:Q6V1X1
Residue:898
BDBM50168272
NameBDBM50168272
Synonyms:(S)-1-[(S)-2-Amino-4-(4-benzoyl-piperazin-1-yl)-4-oxo-butyryl]-pyrrolidine-2-carbonitrile | CHEMBL190029
TypeSmall organic molecule
Emp. Form.C20H25N5O3
Mol. Mass.383.4442
SMILESN[C@@H](CC(=O)N1CCN(CC1)C(=O)c1ccccc1)C(=O)N1CCC[C@H]1C#N