Reaction Details
TargetThromboxane A2 receptor
LigandBDBM50168287
Substrate/Competitorn/a
Meas. Tech.ChEMBL_302574 (CHEMBL839535)
Ki 930±n/a nM
Citation Hattori, KTakamura, FTanaka, ATakasugi, HTaniguchi, KNishio, MKoyama, SSeki, JSakane, K Metabolism investigation leading to novel drug design: orally active prostacyclin mimetics. Part 4. Bioorg Med Chem Lett15:3284-7 (2005) 
 
Thromboxane A2 receptor
Name:Thromboxane A2 receptor
Type:Enyzme
Mol. Mass.:37445.28
Organism:Homo sapiens (Human)
Description:P21731
Residue:343
BDBM50168287
NameBDBM50168287
Synonyms:CHEMBL363800 | Sodium; {3-[(1R,2S,6S)-1-(4,5-diphenyl-oxazol-2-yl)-7-oxa-bicyclo[4.1.0]hept-2-ylmethyl]-phenoxy}-acetate
TypeSmall organic molecule
Emp. Form.C30H26NO5
Mol. Mass.480.5317
SMILES[O-]C(=O)COc1cccc(C[C@@H]2CCC[C@@H]3O[C@]23c2nc(c(o2)-c2ccccc2)-c2ccccc2)c1