Reaction Details
TargetProstaglandin E2 receptor EP1 subtype
LigandBDBM50136234
Substrate/Competitorn/a
Meas. Tech.ChEMBL_302423 (CHEMBL828826)
Ki>1000±n/a nM
Citation Hattori, KTakamura, FTanaka, ATakasugi, HTaniguchi, KNishio, MKoyama, SSeki, JSakane, K Metabolism investigation leading to novel drug design: orally active prostacyclin mimetics. Part 4. Bioorg Med Chem Lett15:3284-7 (2005) 
 
Prostaglandin E2 receptor EP1 subtype
Name:Prostaglandin E2 receptor EP1 subtype
Type:Enzyme
Mol. Mass.:41834.57
Organism:Homo sapiens (Human)
Description:P34995
Residue:402
BDBM50136234
NameBDBM50136234
Synonyms:CHEMBL132589 Sodium; {3-[(R)-2-(4,5-diphenyl-oxazol-2-yl)-cyclohex-2-enylmethyl]-phenoxy}-acetate Sodium; {3-[2-(4,5-diphenyl-oxazol-2-yl)-cyclohex-2-enylmethyl]-phenoxy}-acetate | sodium (S)-2-(3-((2-(4,5-diphenyloxazol-2-yl)cyclohex-2-enyl)methyl)phenoxy)acetate
TypeSmall organic molecule
Emp. Form.C30H26NO4
Mol. Mass.464.5323
SMILES[O-]C(=O)COc1cccc(CC2CCCC=C2c2nc(c(o2)-c2ccccc2)-c2ccccc2)c1