Reaction Details
TargetFibroblast growth factor receptor 1
LigandBDBM50168395
Substrate/Competitorn/a
Meas. Tech.ChEMBL_305013 (CHEMBL829448)
IC50 68±n/a nM
Citation Borzilleri, RMZheng, XQian, LEllis, CCai, ZWWautlet, BSMortillo, SJeyaseelan, RKukral, DWFura, AKamath, AVyas, VTokarski, JSBarrish, JCHunt, JTLombardo, LJFargnoli, JBhide, RS Design, synthesis, and evaluation of orally active 4-(2,4-difluoro-5-(methoxycarbamoyl)phenylamino)pyrrolo[2,1-f][1,2,4]triazines as dual vascular endothelial growth factor receptor-2 and fibroblast growth factor receptor-1 inhibitors. J Med Chem48:3991-4008 (2005) 
 
Fibroblast growth factor receptor 1
Name:Fibroblast growth factor receptor 1
Type:Receptor
Mol. Mass.:91861.70
Organism:Homo sapiens (Human)
Description:P11362
Residue:822
BDBM50168395
NameBDBM50168395
Synonyms:2,4-Difluoro-5-{5-isopropyl-6-[5-(2,2,2-trifluoro-ethyl)-[1,3,4]oxadiazol-2-yl]-pyrrolo[2,1-f][1,2,4]triazin-4-ylamino}-N-methoxy-benzamide | CHEMBL194872
TypeSmall organic molecule
Emp. Form.C21H18F5N7O3
Mol. Mass.511.4047
SMILESCONC(=O)c1cc(Nc2ncnn3cc(-c4nnc(CC(F)(F)F)o4)c(C(C)C)c23)c(F)cc1F