Reaction Details
TargetFibroblast growth factor receptor 1
LigandBDBM50168389
Substrate/Competitorn/a
Meas. Tech.ChEMBL_305013 (CHEMBL829448)
IC50 58±n/a nM
Citation Borzilleri, RMZheng, XQian, LEllis, CCai, ZWWautlet, BSMortillo, SJeyaseelan, RKukral, DWFura, AKamath, AVyas, VTokarski, JSBarrish, JCHunt, JTLombardo, LJFargnoli, JBhide, RS Design, synthesis, and evaluation of orally active 4-(2,4-difluoro-5-(methoxycarbamoyl)phenylamino)pyrrolo[2,1-f][1,2,4]triazines as dual vascular endothelial growth factor receptor-2 and fibroblast growth factor receptor-1 inhibitors. J Med Chem48:3991-4008 (2005) 
 
Fibroblast growth factor receptor 1
Name:Fibroblast growth factor receptor 1
Type:Receptor
Mol. Mass.:91861.70
Organism:Homo sapiens (Human)
Description:P11362
Residue:822
BDBM50168389
NameBDBM50168389
Synonyms:CHEMBL195218 | [4-(2,4-Difluoro-5-methoxycarbamoyl-phenylamino)-5-isopropyl-pyrrolo[2,1-f][1,2,4]triazin-6-yl]-carbamic acid 3-methanesulfonyl-propyl ester
TypeSmall organic molecule
Emp. Form.C22H26F2N6O6S
Mol. Mass.540.54
SMILESCONC(=O)c1cc(Nc2ncnn3cc(NC(=O)OCCCS(C)(=O)=O)c(C(C)C)c23)c(F)cc1F