Reaction Details
TargetVascular endothelial growth factor receptor 2
LigandBDBM50168388
Substrate/Competitorn/a
Meas. Tech.ChEMBL_305591 (CHEMBL828038)
IC50 17±n/a nM
Citation Borzilleri, RMZheng, XQian, LEllis, CCai, ZWWautlet, BSMortillo, SJeyaseelan, RKukral, DWFura, AKamath, AVyas, VTokarski, JSBarrish, JCHunt, JTLombardo, LJFargnoli, JBhide, RS Design, synthesis, and evaluation of orally active 4-(2,4-difluoro-5-(methoxycarbamoyl)phenylamino)pyrrolo[2,1-f][1,2,4]triazines as dual vascular endothelial growth factor receptor-2 and fibroblast growth factor receptor-1 inhibitors. J Med Chem48:3991-4008 (2005) 
 
Vascular endothelial growth factor receptor 2
Name:Vascular endothelial growth factor receptor 2
Type:Receptor Tyrosine Kinase
Mol. Mass.:151510.97
Organism:Homo sapiens (Human)
Description:P35968
Residue:1356
BDBM50168388
NameBDBM50168388
Synonyms:5-[6-(5-Cyclopropylmethyl-[1,3,4]oxadiazol-2-yl)-5-isopropyl-pyrrolo[2,1-f][1,2,4]triazin-4-ylamino]-2,4-difluoro-N-methoxy-benzamide | CHEMBL191913
TypeSmall organic molecule
Emp. Form.C23H23F2N7O3
Mol. Mass.483.4706
SMILESCONC(=O)c1cc(Nc2ncnn3cc(-c4nnc(CC5CC5)o4)c(C(C)C)c23)c(F)cc1F