Reaction Details
TargetPeroxisome proliferator-activated receptor alpha
LigandBDBM50168554
Substrate/Competitorn/a
Meas. Tech.ChEMBL_304582 (CHEMBL828473)
IC50 7.0±n/a nM
Citation Koyama, HBoueres, JKMiller, DJBerger, JPMacNaul, KLWang, PRIppolito, MCWright, SDAgrawal, AKMoller, DESahoo, SP (2R)-2-methylchromane-2-carboxylic acids: discovery of selective PPARalpha agonists as hypolipidemic agents. Bioorg Med Chem Lett15:3347-51 (2005) 
 
Peroxisome proliferator-activated receptor alpha
Name:Peroxisome proliferator-activated receptor alpha
Type:Enzyme
Mol. Mass.:52222.08
Organism:Homo sapiens (Human)
Description:Q07869
Residue:468
BDBM50168554
NameBDBM50168554
Synonyms:(R)-7-{3-[2-Chloro-4-(1,1-dimethyl-propyl)-phenoxy]-propoxy}-2-methyl-chroman-2-carboxylic acid | CHEMBL369725
TypeSmall organic molecule
Emp. Form.C25H31ClO5
Mol. Mass.446.964
SMILESCCC(C)(C)c1ccc(OCCCOc2ccc3CC[C@@](C)(Oc3c2)C(O)=O)c(Cl)c1