Reaction Details
TargetRibosomal protein S6 kinase alpha-5
LigandBDBM50168576
Substrate/Competitorn/a
Meas. Tech.ChEMBL_304581 (CHEMBL828472)
IC50 20±n/a nM
Citation Bamford, MJAlberti, MJBailey, NDavies, SDean, DKGaiba, AGarland, SHarling, JDJung, DKPanchal, TAParr, CASteadman, JGTakle, AKTownsend, JTWilson, DMWitherington, J (1H-imidazo[4,5-c]pyridin-2-yl)-1,2,5-oxadiazol-3-ylamine derivatives: a novel class of potent MSK-1-inhibitors. Bioorg Med Chem Lett15:3402-6 (2005) 
 
Ribosomal protein S6 kinase alpha-5
Name:Ribosomal protein S6 kinase alpha-5
Type:Serine/threonine-protein kinase
Mol. Mass.:89874.44
Organism:Homo sapiens (Human)
Description:n/a
Residue:802
BDBM50168576
NameBDBM50168576
Synonyms:3-(1-Ethyl-1H-imidazo[4,5-c]pyridin-2-yl)-pyrazin-2-ylamine | CHEMBL189299
TypeSmall organic molecule
Emp. Form.C12H12N6
Mol. Mass.240.2639
SMILESCCn1c(nc2cnccc12)-c1nccnc1N