Reaction Details
TargetRibosomal protein S6 kinase alpha-5
LigandBDBM50168601
Substrate/Competitorn/a
Meas. Tech.ChEMBL_304581 (CHEMBL828472)
IC50 17±n/a nM
Citation Bamford, MJAlberti, MJBailey, NDavies, SDean, DKGaiba, AGarland, SHarling, JDJung, DKPanchal, TAParr, CASteadman, JGTakle, AKTownsend, JTWilson, DMWitherington, J (1H-imidazo[4,5-c]pyridin-2-yl)-1,2,5-oxadiazol-3-ylamine derivatives: a novel class of potent MSK-1-inhibitors. Bioorg Med Chem Lett15:3402-6 (2005) 
 
Ribosomal protein S6 kinase alpha-5
Name:Ribosomal protein S6 kinase alpha-5
Type:Serine/threonine-protein kinase
Mol. Mass.:89874.44
Organism:Homo sapiens (Human)
Description:n/a
Residue:802
BDBM50168601
NameBDBM50168601
Synonyms:4-(1-Piperidin-4-yl-1H-imidazo[4,5-c]pyridin-2-yl)-furazan-3-ylamine | CHEMBL363054
TypeSmall organic molecule
Emp. Form.C13H15N7O
Mol. Mass.285.3045
SMILESNc1nonc1-c1nc2cnccc2n1C1CCNCC1