Reaction Details
TargetMelanin-concentrating hormone receptor 1
LigandBDBM50168636
Substrate/Competitorn/a
Meas. Tech.ChEMBL_303766 (CHEMBL829988)
Ki 5±n/a nM
Citation Rowbottom, MWVickers, TDDyck, BTamiya, JZhang, MZhao, LGrey, JProvencal, DSchwarz, DHeise, CEMistry, MFisher, ADong, THu, TSaunders, JGoodfellow, VS Synthesis and structure-activity relationships of biarylcarboxamide bis-aminopyrrolidine urea derived small-molecule antagonists of the melanin-concentrating hormone receptor-1 (MCH-R1). Bioorg Med Chem Lett15:3439-45 (2005) 
 
Melanin-concentrating hormone receptor 1
Name:Melanin-concentrating hormone receptor 1
Type:G Protein-Coupled Receptor (GPCR)
Mol. Mass.:45976.27
Organism:Homo sapiens (Human)
Description:Membranes from CHO-K1 cells stably expressing human MCH1R were used in assays.
Residue:422
BDBM50168636
NameBDBM50168636
Synonyms:(S)-3-{[5-(4-Isopropyl-phenyl)-thiophene-2-carbonyl]-methyl-amino}-pyrrolidine-1-carboxylic acid methyl-((R)-1-methyl-pyrrolidin-3-yl)-amide | CHEMBL189190
TypeSmall organic molecule
Emp. Form.C26H36N4O2S
Mol. Mass.468.655
SMILESCC(C)c1ccc(cc1)-c1ccc(s1)C(=O)N(C)[C@H]1CCN(C1)C(=O)N(C)[C@@H]1CCN(C)C1