Reaction Details
TargetDisintegrin and metalloproteinase domain-containing protein 17
LigandBDBM50168738
Substrate/Competitorn/a
Meas. Tech.ChEMBL_305111 (CHEMBL831580)
IC50 1.9±n/a nM
Citation Noe, MCNatarajan, VSnow, SLWolf-Gouveia, LAMitchell, PGLopresti-Morrow, LReeves, LMYocum, SAOtterness, IBliven, MACarty, TJBarberia, JTSweeney, FJLiras, JLVaughn, M Discovery of 3-OH-3-methylpipecolic hydroxamates: potent orally active inhibitors of aggrecanase and MMP-13. Bioorg Med Chem Lett15:3385-8 (2005) 
 
Disintegrin and metalloproteinase domain-containing protein 17
Name:Disintegrin and metalloproteinase domain-containing protein 17
Type:Enzyme
Mol. Mass.:93007.89
Organism:Homo sapiens (Human)
Description:
Residue:824
BDBM50168738
NameBDBM50168738
Synonyms:(2R,3R)-1-[4-(5-Fluoro-2-methyl-benzyloxy)-benzenesulfonyl]-3-hydroxy-3-methyl-piperidine-2-carboxylic acid hydroxyamide | CHEMBL186500
TypeSmall organic molecule
Emp. Form.C21H25FN2O6S
Mol. Mass.452.496
SMILESCc1ccc(F)cc1COc1ccc(cc1)S(=O)(=O)N1CCC[C@@](C)(O)[C@@H]1C(=O)NO