Reaction Details
TargetMatrix metalloproteinase-14
LigandBDBM50168737
Substrate/Competitorn/a
Meas. Tech.ChEMBL_304645 (CHEMBL828528)
IC50 83±n/a nM
Citation Noe, MCNatarajan, VSnow, SLWolf-Gouveia, LAMitchell, PGLopresti-Morrow, LReeves, LMYocum, SAOtterness, IBliven, MACarty, TJBarberia, JTSweeney, FJLiras, JLVaughn, M Discovery of 3-OH-3-methylpipecolic hydroxamates: potent orally active inhibitors of aggrecanase and MMP-13. Bioorg Med Chem Lett15:3385-8 (2005) 
 
Matrix metalloproteinase-14
Name:Matrix metalloproteinase-14
Type:Protein
Mol. Mass.:65900.19
Organism:Homo sapiens (Human)
Description:P50281
Residue:582
BDBM50168737
NameBDBM50168737
Synonyms:(2R,3R)-1-[4-(2-Chloro-4-fluoro-benzyloxy)-benzenesulfonyl]-3-hydroxy-3-methyl-piperidine-2-carboxylic acid hydroxyamide | CHEMBL187092
TypeSmall organic molecule
Emp. Form.C20H22ClFN2O6S
Mol. Mass.472.915
SMILESC[C@@]1(O)CCCN([C@H]1C(=O)NO)S(=O)(=O)c1ccc(OCc2ccc(F)cc2Cl)cc1