Reaction Details
TargetProstaglandin E synthase 2
LigandBDBM50168761
Substrate/Competitorn/a
Meas. Tech.ChEMBL_304710 (CHEMBL876474)
IC50>1000±n/a nM
Citation Riendeau, DAspiotis, REthier, DGareau, YGrimm, ELGuay, JGuiral, SJuteau, HMancini, JAMéthot, NRubin, JFriesen, RW Inhibitors of the inducible microsomal prostaglandin E2 synthase (mPGES-1) derived from MK-886. Bioorg Med Chem Lett15:3352-5 (2005) 
 
Prostaglandin E synthase 2
Name:Prostaglandin E synthase 2
Type:Enzyme
Mol. Mass.:41955.21
Organism:Homo sapiens (Human)
Description:Q9H7Z7
Residue:377
BDBM50168761
NameBDBM50168761
Synonyms:3-(1-(4-chlorobenzyl)-5-(2-fluorobiphenyl-4-yl)-3-methyl-1H-indol-2-yl)-2,2-dimethylpropanoic acid CHEMBL182032
TypeSmall organic molecule
Emp. Form.C33H29ClFNO2
Mol. Mass.526.04
SMILESCc1c(CC(C)(C)C(O)=O)n(Cc2ccc(Cl)cc2)c2ccc(cc12)-c1ccc(c(F)c1)-c1ccccc1