Reaction Details
TargetArachidonate 5-lipoxygenase-activating protein
LigandBDBM50168766
Substrate/Competitorn/a
Meas. Tech.ChEMBL_304998 (CHEMBL829434)
IC50>1000±n/a nM
Citation Riendeau, DAspiotis, REthier, DGareau, YGrimm, ELGuay, JGuiral, SJuteau, HMancini, JAMéthot, NRubin, JFriesen, RW Inhibitors of the inducible microsomal prostaglandin E2 synthase (mPGES-1) derived from MK-886. Bioorg Med Chem Lett15:3352-5 (2005) 
 
Arachidonate 5-lipoxygenase-activating protein
Name:Arachidonate 5-lipoxygenase-activating protein
Type:Enzyme
Mol. Mass.:18159.90
Organism:Homo sapiens (Human)
Description:P20292
Residue:161
BDBM50168766
NameBDBM50168766
Synonyms:3-(1-(4-chlorobenzyl)-5-(2-fluoro-2'-methylbiphenyl-4-yl)-3-methyl-1H-indol-2-yl)-2,2-dimethylpropanoic acid CHEMBL180650
TypeSmall organic molecule
Emp. Form.C34H31ClFNO2
Mol. Mass.540.067
SMILESCc1c(CC(C)(C)C(O)=O)n(Cc2ccc(Cl)cc2)c2ccc(cc12)-c1ccc(c(F)c1)-c1ccccc1C