Reaction Details
TargetMelanin-concentrating hormone receptor 1
LigandBDBM50168821
Substrate/Competitorn/a
Meas. Tech.ChEMBL_302713 (CHEMBL839584)
Ki 20±n/a nM
Citation Guo, THunter, RCGu, HRokosz, LLStauffer, TMHobbs, DW Discovery and SAR of 4-amino-2-biarylbutylurea MCH 1 receptor antagonists through solid-phase parallel synthesis. Bioorg Med Chem Lett15:3691-5 (2005) 
 
Melanin-concentrating hormone receptor 1
Name:Melanin-concentrating hormone receptor 1
Type:G Protein-Coupled Receptor (GPCR)
Mol. Mass.:45976.27
Organism:Homo sapiens (Human)
Description:Membranes from CHO-K1 cells stably expressing human MCH1R were used in assays.
Residue:422
BDBM50168821
NameBDBM50168821
Synonyms:1-[4-Cyclopentylamino-2-(3'-trifluoromethoxy-biphenyl-4-yl)-butyl]-3-(3,5-dichloro-phenyl)-urea | CHEMBL360732
TypeSmall organic molecule
Emp. Form.C29H30Cl2F3N3O2
Mol. Mass.580.469
SMILESFC(F)(F)Oc1cccc(c1)-c1ccc(cc1)C(CCNC1CCCC1)CNC(=O)Nc1cc(Cl)cc(Cl)c1