Reaction Details
TargetRibosomal protein S6 kinase alpha-5
LigandBDBM50168854
Substrate/Competitorn/a
Meas. Tech.ChEMBL_304566 (CHEMBL877123)
IC50 1.4±n/a nM
Citation Bamford, MJBailey, NDavies, SDean, DKFrancis, LPanchal, TAParr, CASehmi, SSteadman, JGTakle, AKTownsend, JTWilson, DM (1H-imidazo[4,5-c]pyridin-2-yl)-1,2,5-oxadiazol-3-ylamine derivatives: further optimisation as highly potent and selective MSK-1-inhibitors. Bioorg Med Chem Lett15:3407-11 (2005) 
 
Ribosomal protein S6 kinase alpha-5
Name:Ribosomal protein S6 kinase alpha-5
Type:Serine/threonine-protein kinase
Mol. Mass.:89874.44
Organism:Homo sapiens (Human)
Description:n/a
Residue:802
BDBM50168854
NameBDBM50168854
Synonyms:4-(1-Ethyl-7-piperazin-1-ylmethyl-1H-imidazo[4,5-c]pyridin-2-yl)-furazan-3-ylamine | CHEMBL415770
TypeSmall organic molecule
Emp. Form.C15H20N8O
Mol. Mass.328.3723
SMILESCCn1c(nc2cncc(CN3CCNCC3)c12)-c1nonc1N