Reaction Details
TargetRibosomal protein S6 kinase beta-1
LigandBDBM14032
Substrate/Competitorn/a
Meas. Tech.ChEMBL_304643 (CHEMBL828526)
IC50 70±n/a nM
Citation Bamford, MJBailey, NDavies, SDean, DKFrancis, LPanchal, TAParr, CASehmi, SSteadman, JGTakle, AKTownsend, JTWilson, DM (1H-imidazo[4,5-c]pyridin-2-yl)-1,2,5-oxadiazol-3-ylamine derivatives: further optimisation as highly potent and selective MSK-1-inhibitors. Bioorg Med Chem Lett15:3407-11 (2005) 
 
Ribosomal protein S6 kinase beta-1
Name:Ribosomal protein S6 kinase beta-1
Type:Enzyme
Mol. Mass.:59139.89
Organism:Homo sapiens (Human)
Description:His-tagged S6K1.
Residue:525
BDBM14032
NameBDBM14032
Synonyms:4-(1-ethyl-1H-imidazo[4,5-c]pyridin-2-yl)-1,2,5-oxadiazol-3-amine Aminofurazanyl-azabenzimidazole 1 | CHEMBL189657
TypeSmall organic molecule
Emp. Form.C10H10N6O
Mol. Mass.230.226
SMILESCCn1c(nc2cnccc12)-c1nonc1N