Reaction Details
TargetRibosomal protein S6 kinase alpha-5
LigandBDBM50168857
Substrate/Competitorn/a
Meas. Tech.ChEMBL_304566 (CHEMBL877123)
IC50 813.0±n/a nM
Citation Bamford, MJBailey, NDavies, SDean, DKFrancis, LPanchal, TAParr, CASehmi, SSteadman, JGTakle, AKTownsend, JTWilson, DM (1H-imidazo[4,5-c]pyridin-2-yl)-1,2,5-oxadiazol-3-ylamine derivatives: further optimisation as highly potent and selective MSK-1-inhibitors. Bioorg Med Chem Lett15:3407-11 (2005) 
 
Ribosomal protein S6 kinase alpha-5
Name:Ribosomal protein S6 kinase alpha-5
Type:Serine/threonine-protein kinase
Mol. Mass.:89874.44
Organism:Homo sapiens (Human)
Description:n/a
Residue:802
BDBM50168857
NameBDBM50168857
Synonyms:4-(1-Ethyl-4-phenyl-1H-imidazo[4,5-c]pyridin-2-yl)-furazan-3-ylamine | CHEMBL186343
TypeSmall organic molecule
Emp. Form.C16H14N6O
Mol. Mass.306.322
SMILESCCn1c(nc2c(nccc12)-c1ccccc1)-c1nonc1N