Reaction Details
TargetRibosomal protein S6 kinase alpha-5
LigandBDBM50168864
Substrate/Competitorn/a
Meas. Tech.ChEMBL_304566 (CHEMBL877123)
IC50 9±n/a nM
Citation Bamford, MJBailey, NDavies, SDean, DKFrancis, LPanchal, TAParr, CASehmi, SSteadman, JGTakle, AKTownsend, JTWilson, DM (1H-imidazo[4,5-c]pyridin-2-yl)-1,2,5-oxadiazol-3-ylamine derivatives: further optimisation as highly potent and selective MSK-1-inhibitors. Bioorg Med Chem Lett15:3407-11 (2005) 
 
Ribosomal protein S6 kinase alpha-5
Name:Ribosomal protein S6 kinase alpha-5
Type:Serine/threonine-protein kinase
Mol. Mass.:89874.44
Organism:Homo sapiens (Human)
Description:n/a
Residue:802
BDBM50168864
NameBDBM50168864
Synonyms:(R,S)-4-[1-(2-Amino-1-methyl-ethyl)-1H-imidazo[4,5-c]pyridin-2-yl]-furazan-3-ylamine | CHEMBL188620
TypeSmall organic molecule
Emp. Form.C11H13N7O
Mol. Mass.259.2672
SMILESCC(CN)n1c(nc2cnccc12)-c1nonc1N