Reaction Details
TargetGlutamate receptor ionotropic, kainate 2
LigandBDBM50168962
Substrate/Competitorn/a
Meas. Tech.ChEMBL_303287 (CHEMBL828280)
Ki>100000±n/a nM
Citation Dominguez, EIyengar, SShannon, HEBleakman, DAlt, AArnold, BMBell, MGBleisch, TJBuckmaster, JLCastano, AMDel Prado, MEscribano, AFilla, SAHo, KHHudziak, KJJones, CKMartinez-Perez, JAMateo, AMathes, BMMattiuz, ELOgden, AMSimmons, RMStack, DRStratford, REWinter, MAWu, ZOrnstein, PL Two prodrugs of potent and selective GluR5 kainate receptor antagonists actives in three animal models of pain. J Med Chem48:4200-3 (2005) 
 
Glutamate receptor ionotropic, kainate 2
Name:Glutamate receptor ionotropic, kainate 2
Type:Enzyme Catalytic Domain
Mol. Mass.:102592.78
Organism:Homo sapiens (Human)
Description:Q13002
Residue:908
BDBM50168962
NameBDBM50168962
Synonyms:(3S,4aR,6S,8aR)-6-(4-Carboxy-benzyl)-decahydro-isoquinoline-3-carboxylic acid CHEMBL274226 | LY 382884
TypeSmall organic molecule
Emp. Form.C18H23NO4
Mol. Mass.317.3795
SMILESOC(=O)[C@@H]1C[C@H]2C[C@@H](Cc3ccc(cc3)C(O)=O)CC[C@H]2CN1