Reaction Details
TargetGlutamate receptor ionotropic, kainate 1
LigandBDBM50168963
Substrate/Competitorn/a
Meas. Tech.ChEMBL_303286 (CHEMBL828279)
Ki 7370±n/a nM
Citation Dominguez, EIyengar, SShannon, HEBleakman, DAlt, AArnold, BMBell, MGBleisch, TJBuckmaster, JLCastano, AMDel Prado, MEscribano, AFilla, SAHo, KHHudziak, KJJones, CKMartinez-Perez, JAMateo, AMathes, BMMattiuz, ELOgden, AMSimmons, RMStack, DRStratford, REWinter, MAWu, ZOrnstein, PL Two prodrugs of potent and selective GluR5 kainate receptor antagonists actives in three animal models of pain. J Med Chem48:4200-3 (2005) 
 
Glutamate receptor ionotropic, kainate 1
Name:Glutamate receptor ionotropic, kainate 1
Type:Enzyme Catalytic Domain
Mol. Mass.:103984.96
Organism:Homo sapiens (Human)
Description:P39086
Residue:918
BDBM50168963
NameBDBM50168963
Synonyms:(3S,4aS,6S,8aR)-6-[2-(1H-Tetrazol-5-yl)-phenoxy]-decahydro-isoquinoline-3-carboxylic acid isobutyl ester | CHEMBL189721
TypeSmall organic molecule
Emp. Form.C21H29N5O3
Mol. Mass.399.4867
SMILESCC(C)COC(=O)[C@@H]1C[C@H]2C[C@H](CC[C@H]2CN1)Oc1ccccc1-c1nnn[nH]1