Reaction Details
TargetAmine oxidase [flavin-containing] A
LigandBDBM50168985
Substrate/Competitorn/a
Meas. Tech.ChEMBL_302385 (CHEMBL830352)
Ki 96±n/a nM
Citation Di Santo, RCosti, RRoux, AArtico, MBefani, OMeninno, TAgostinelli, EPalmegiani, PTurini, PCirilli, RFerretti, RGallinella, BLa Torre, F Design, synthesis, and biological activities of pyrrolylethanoneamine derivatives, a novel class of monoamine oxidases inhibitors. J Med Chem48:4220-3 (2005) 
 
Amine oxidase [flavin-containing] A
Name:Amine oxidase [flavin-containing] A
Type:Enzyme
Mol. Mass.:59515.21
Organism:Rattus norvegicus (rat)
Description:n/a
Residue:526
BDBM50168985
NameBDBM50168985
Synonyms:1-(1-Methyl-1H-pyrrol-2-yl)-2-phenyl-2-piperidin-1-yl-ethanone (racemic) | CHEMBL371359
TypeSmall organic molecule
Emp. Form.C18H22N2O
Mol. Mass.282.3801
SMILESCn1cccc1C(=O)C(N1CCCCC1)c1ccccc1