Reaction Details
TargetSodium-dependent serotonin transporter
LigandBDBM50169010
Substrate/Competitorn/a
Meas. Tech.ChEMBL_303776 (CHEMBL830133)
Ki 1.12±n/a nM
Citation Jarkas, NMcConathy, JVoll, RJGoodman, MM Synthesis, in vitro characterization, and radiolabeling of N,N-dimethyl-2-(2'-amino-4'-substituted-phenylthio)benzylamines: potential candidates as selective serotonin transporter radioligands. J Med Chem48:4254-65 (2005) 
 
Sodium-dependent serotonin transporter
Name:Sodium-dependent serotonin transporter
Type:Multi-pass membrane protein
Mol. Mass.:70322.51
Organism:Homo sapiens (Human)
Description:P31645
Residue:630
BDBM50169010
NameBDBM50169010
Synonyms:2-(2-Dimethylaminomethyl-phenylsulfanyl)-5-vinyl-phenylamine | CHEMBL190703
TypeSmall organic molecule
Emp. Form.C17H20N2S
Mol. Mass.284.419
SMILESCN(C)Cc1ccccc1Sc1ccc(C=C)cc1N