Reaction Details
TargetPlasmepsin I
LigandBDBM50169105
Substrate/Competitorn/a
Meas. Tech.ChEMBL_302875 (CHEMBL828789)
Ki 1±n/a nM
Citation Johansson, POLindberg, JBlackman, MJKvarnström, IVrang, LHamelink, EHallberg, ARosenquist, ASamuelsson, B Design and synthesis of potent inhibitors of plasmepsin I and II: X-ray crystal structure of inhibitor in complex with plasmepsin II. J Med Chem48:4400-9 (2005) 
 
Plasmepsin I
Name:Plasmepsin I
Type:Enzyme
Mol. Mass.:51463.30
Organism:Plasmodium falciparum
Description:n/a
Residue:452
BDBM50169105
NameBDBM50169105
Synonyms:CHEMBL370086 | Pyridine-2-carboxylic acid {(S)-1-[(1S,2S)-3-butylcarbamoyl-2-hydroxy-1-(4-thiophen-3-yl-benzyloxymethyl)-propylcarbamoyl]-2-methyl-propyl}-amide
TypeSmall organic molecule
Emp. Form.C31H40N4O5S
Mol. Mass.580.738
SMILESCCCCNC(=O)C[C@H](O)[C@H](COCc1ccc(cc1)-c1ccsc1)NC(=O)[C@@H](NC(=O)c1ccccn1)C(C)C