Reaction Details
Target5-hydroxytryptamine receptor 2A
LigandBDBM50169265
Substrate/Competitorn/a
Meas. Tech.ChEMBL_303106 (CHEMBL829616)
Ki 32±n/a nM
Citation Röver, SAdams, DRBénardeau, ABentley, JMBickerdike, MJBourson, ACliffe, IACoassolo, PDavidson, JEDourish, CTHebeisen, PKennett, GAKnight, ARMalcolm, CSMattei, PMisra, AMizrahi, JMuller, MPorter, RHRichter, HTaylor, SVickers, SP Identification of 4-methyl-1,2,3,4,10,10a-hexahydropyrazino[1,2-a]indoles as 5-HT2C receptor agonists. Bioorg Med Chem Lett15:3604-8 (2005) 
 
5-hydroxytryptamine receptor 2A
Name:5-hydroxytryptamine receptor 2A
Type:undefined
Mol. Mass.:52607.65
Organism:Homo sapiens (Human)
Description:P28223
Residue:471
BDBM50169265
NameBDBM50169265
Synonyms:7-Chloro-1,2,3,4,10,10a-hexahydro-pyrazino[1,2-a]indole | CHEMBL188605
TypeSmall organic molecule
Emp. Form.C11H13ClN2
Mol. Mass.208.687
SMILESClc1ccc2CC3CNCCN3c2c1