Reaction Details
Target5-hydroxytryptamine receptor 2C
LigandBDBM50169265
Substrate/Competitorn/a
Meas. Tech.ChEMBL_303087 (CHEMBL828759)
Ki 31±n/a nM
Citation Röver, SAdams, DRBénardeau, ABentley, JMBickerdike, MJBourson, ACliffe, IACoassolo, PDavidson, JEDourish, CTHebeisen, PKennett, GAKnight, ARMalcolm, CSMattei, PMisra, AMizrahi, JMuller, MPorter, RHRichter, HTaylor, SVickers, SP Identification of 4-methyl-1,2,3,4,10,10a-hexahydropyrazino[1,2-a]indoles as 5-HT2C receptor agonists. Bioorg Med Chem Lett15:3604-8 (2005) 
 
5-hydroxytryptamine receptor 2C
Name:5-hydroxytryptamine receptor 2C
Type:G Protein-Coupled Receptor (GPCR)
Mol. Mass.:51836.79
Organism:Homo sapiens (Human)
Description:P28335
Residue:458
BDBM50169265
NameBDBM50169265
Synonyms:7-Chloro-1,2,3,4,10,10a-hexahydro-pyrazino[1,2-a]indole | CHEMBL188605
TypeSmall organic molecule
Emp. Form.C11H13ClN2
Mol. Mass.208.687
SMILESClc1ccc2CC3CNCCN3c2c1