Reaction Details
Target5-hydroxytryptamine receptor 2A
LigandBDBM50169258
Substrate/Competitorn/a
Meas. Tech.ChEMBL_303106 (CHEMBL829616)
Ki 110±n/a nM
Citation Röver, SAdams, DRBénardeau, ABentley, JMBickerdike, MJBourson, ACliffe, IACoassolo, PDavidson, JEDourish, CTHebeisen, PKennett, GAKnight, ARMalcolm, CSMattei, PMisra, AMizrahi, JMuller, MPorter, RHRichter, HTaylor, SVickers, SP Identification of 4-methyl-1,2,3,4,10,10a-hexahydropyrazino[1,2-a]indoles as 5-HT2C receptor agonists. Bioorg Med Chem Lett15:3604-8 (2005) 
 
5-hydroxytryptamine receptor 2A
Name:5-hydroxytryptamine receptor 2A
Type:undefined
Mol. Mass.:52607.65
Organism:Homo sapiens (Human)
Description:P28223
Residue:471
BDBM50169258
NameBDBM50169258
Synonyms:(4R,10aR)-4-Methyl-1,2,3,4,10,10a-hexahydro-pyrazino[1,2-a]indole-7-carbonitrile | CHEMBL187888
TypeSmall organic molecule
Emp. Form.C13H15N3
Mol. Mass.213.2783
SMILESC[C@@H]1CNC[C@H]2Cc3ccc(cc3N12)C#N