Reaction Details
TargetMelanin-concentrating hormone receptor 1
LigandBDBM50169378
Substrate/Competitorn/a
Meas. Tech.ChEMBL_303523 (CHEMBL839637)
Ki 155±n/a nM
Citation Guo, TShao, YQian, GRokosz, LLStauffer, TMHunter, RCBabu, SDGu, HHobbs, DW Discovery and SAR of biaryl piperidine MCH1 receptor antagonists through solid-phase encoded combinatorial synthesis. Bioorg Med Chem Lett15:3696-700 (2005) 
 
Melanin-concentrating hormone receptor 1
Name:Melanin-concentrating hormone receptor 1
Type:G Protein-Coupled Receptor (GPCR)
Mol. Mass.:45976.27
Organism:Homo sapiens (Human)
Description:Membranes from CHO-K1 cells stably expressing human MCH1R were used in assays.
Residue:422
BDBM50169378
NameBDBM50169378
Synonyms:3,5-Dichloro-N-[4-(3'-cyano-biphenyl-4-yl)-1-methyl-piperidin-4-ylmethyl]-benzamide | CHEMBL179869
TypeSmall organic molecule
Emp. Form.C27H25Cl2N3O
Mol. Mass.478.413
SMILESCN1CCC(CNC(=O)c2cc(Cl)cc(Cl)c2)(CC1)c1ccc(cc1)-c1cccc(c1)C#N